Target
Virulence factor transcriptional regulator MvfR
Ligand
BDBM50440133
Substrate
Meas. Tech.
ChEMBL_980942 (CHEMBL2427495)
Kd
900±n/a nM
Citation
 Zender, MKlein, THenn, CKirsch, BMaurer, CKKail, DRitter, CDolezal, OSteinbach, AHartmann, RW Discovery and biophysical characterization of 2-amino-oxadiazoles as novel antagonists of PqsR, an important regulator of Pseudomonas aeruginosa virulence. J Med Chem 56:6761-74 (2013)  
Target
Name:
Virulence factor transcriptional regulator MvfR
Synonyms:
Transcriptional regulator MvfR
Type:
PROTEIN
Mol. Mass.:
37217.11
Organism:
Pseudomonas aeruginosa PA14
Description:
ChEMBL_107649
Residue:
332
  
Inhibitor
Name:
BDBM50440133
Synonyms:
CHEMBL2426225
Type:
Small organic molecule
Emp. Form.:
C11H15NO
Mol. Mass.:
177.2429
SMILES:
CC(C)(C)c1ccc(cc1)C(N)=O
: