Target
Glucocorticoid receptor
Ligand
BDBM50440223
Substrate
Meas. Tech.
ChEMBL_982008 (CHEMBL2428212)
Ki
11±n/a nM
Citation
 Sheppeck, JEGilmore, JLXiao, HYDhar, TGNirschl, DDoweyko, AMSack, JSCorbett, MJMalley, MFGougoutas, JZMckay, LCunningham, MDHabte, SFDodd, JHNadler, SGSomerville, JEBarrish, JC Discovery of potent and selective nonsteroidal indazolyl amide glucocorticoid receptor agonists. Bioorg Med Chem Lett 23:5442-7 (2013)  
Target
Name:
Glucocorticoid receptor
Synonyms:
GCR_HUMAN GRL Glucocorticoid receptor (GRFP) Nuclear receptor subfamily 3 group C member 1
Type:
Enzyme
Mol. Mass.:
85656.87
Organism:
Homo sapiens (Human)
Description:
P04150
Residue:
777
  
Inhibitor
Name:
BDBM50440223
Synonyms:
CHEMBL2426627
Type:
Small organic molecule
Emp. Form.:
C28H25FN4OS
Mol. Mass.:
484.588
SMILES:
Cc1cnc(NC(=O)C(C)(C)C(c2ccccc2)c2ccc3n(ncc3c2)-c2ccc(F)cc2)s1
: