Target
Glucocorticoid receptor
Ligand
BDBM50348410
Substrate
Meas. Tech.
ChEMBL_982008 (CHEMBL2428212)
Ki
1.1±n/a nM
Citation
 Sheppeck, JEGilmore, JLXiao, HYDhar, TGNirschl, DDoweyko, AMSack, JSCorbett, MJMalley, MFGougoutas, JZMckay, LCunningham, MDHabte, SFDodd, JHNadler, SGSomerville, JEBarrish, JC Discovery of potent and selective nonsteroidal indazolyl amide glucocorticoid receptor agonists. Bioorg Med Chem Lett 23:5442-7 (2013)  
Target
Name:
Glucocorticoid receptor
Synonyms:
GCR_HUMAN GRL Glucocorticoid receptor (GRFP) Nuclear receptor subfamily 3 group C member 1
Type:
Enzyme
Mol. Mass.:
85656.87
Organism:
Homo sapiens (Human)
Description:
P04150
Residue:
777
  
Inhibitor
Name:
BDBM50348410
Synonyms:
CHEMBL1801004
Type:
Small organic molecule
Emp. Form.:
C19H19N3O2S
Mol. Mass.:
353.438
SMILES:
CC(C)([C@@H](c1ccccc1)c1ccc(O)cc1)C(=O)Nc1nncs1
: