Target
D(2) dopamine receptor
Ligand
BDBM50441458
Substrate
Meas. Tech.
ChEMBL_988250 (CHEMBL2439594)
Ki
>10000±n/a nM
Citation
 Dukat, MAlix, KWorsham, JKhatri, SSchulte, MK 2-Amino-6-chloro-3,4-dihydroquinazoline: A novel 5-HT3 receptor antagonist with antidepressant character. Bioorg Med Chem Lett 23:5945-8 (2013)  
Target
Name:
D(2) dopamine receptor
Synonyms:
D(2) dopamine receptor DOPAMINE D2 Long DRD2 Dopamine D2 receptor Dopamine D2 receptor (D2R) Dopamine2-like | d2
Type:
Cell-surface receptors
Mol. Mass.:
50647.10
Organism:
Homo sapiens (Human)
Description:
P14416
Residue:
443
  
Inhibitor
Name:
BDBM50441458
Synonyms:
CHEMBL2436555
Type:
Small organic molecule
Emp. Form.:
C8H8ClN3
Mol. Mass.:
181.622
SMILES:
NC1=NCc2cc(Cl)ccc2N1
: