Target
5-hydroxytryptamine receptor 3A
Ligand
BDBM50441458
Substrate
Meas. Tech.
ChEMBL_988339 (CHEMBL2437602)
Ki
34±n/a nM
Citation
 Dukat, MAlix, KWorsham, JKhatri, SSchulte, MK 2-Amino-6-chloro-3,4-dihydroquinazoline: A novel 5-HT3 receptor antagonist with antidepressant character. Bioorg Med Chem Lett 23:5945-8 (2013)  
Target
Name:
5-hydroxytryptamine receptor 3A
Synonyms:
5-HT-3 5-HT3A 5-hydroxytryptamine receptor 3 (5-HT3) 5-hydroxytryptamine receptor 3A (5HT3A) 5HT3R HTR3A Serotonin 3 receptor (5HT3) Serotonin-gated ion channel receptor | Serotonin-gated ion channel receptor 3
Type:
Protein
Mol. Mass.:
55283.27
Organism:
Homo sapiens (Human)
Description:
P46098
Residue:
478
  
Inhibitor
Name:
BDBM50441458
Synonyms:
CHEMBL2436555
Type:
Small organic molecule
Emp. Form.:
C8H8ClN3
Mol. Mass.:
181.622
SMILES:
NC1=NCc2cc(Cl)ccc2N1
: