Target
Bifunctional epoxide hydrolase 2
Ligand
BDBM50441469
Substrate
Meas. Tech.
ChEMBL_988349 (CHEMBL2437612)
IC50
0.300000±n/a nM
Citation
 Kato, YFuchi, NSaburi, HNishimura, YWatanabe, AYagi, MNakadera, YHigashi, EYamada, MAoki, T Discovery of 2,8-diazaspiro[4.5]decane-based trisubstituted urea derivatives as highly potent soluble epoxide hydrolase inhibitors and orally active drug candidates for treating hypertension. Bioorg Med Chem Lett 23:5975-9 (2013)  
Target
Name:
Bifunctional epoxide hydrolase 2
Synonyms:
Cytosolic epoxide hydrolase 2 EPHX2 HYES_HUMAN Soluble epoxide hydrolase (sEH) | epoxide hydrolase 2, cytoplasmic
Type:
Enzyme
Mol. Mass.:
62613.07
Organism:
Homo sapiens (Human)
Description:
P34913
Residue:
555
  
Inhibitor
Name:
BDBM50441469
Synonyms:
CHEMBL2436586
Type:
Small organic molecule
Emp. Form.:
C21H23F6N3O3
Mol. Mass.:
479.416
SMILES:
FC(F)(F)Oc1ccc(NC(=O)N2CCC3(C2)CCN(CC3)C(=O)C2(CC2)C(F)(F)F)cc1
: