Target
Insulin receptor
Ligand
BDBM50441566
Substrate
Meas. Tech.
ChEMBL_988908 (CHEMBL2439762)
IC50
1290±n/a nM
Citation
 Goodfellow, VSLoweth, CJRavula, SBWiemann, TNguyen, TXu, YTodd, DESheppard, DPollack, SPolesskaya, OMarker, DFDewhurst, SGelbard, HA Discovery, synthesis, and characterization of an orally bioavailable, brain penetrant inhibitor of mixed lineage kinase 3. J Med Chem 56:8032-48 (2013)  
Target
Name:
Insulin receptor
Synonyms:
INSR INSR_HUMAN Insulin receptor beta subunit
Type:
Receptor Tyrosine Kinase
Mol. Mass.:
156322.60
Organism:
Homo sapiens (Human)
Description:
P06213
Residue:
1382
  
Inhibitor
Name:
BDBM50441566
Synonyms:
CHEMBL2436977 | US10485800, Example 179
Type:
Small organic molecule
Emp. Form.:
C26H26N6
Mol. Mass.:
422.5248
SMILES:
CN1CCN(Cc2ccc(cc2)-c2cnc3[nH]cc(-c4cnc5[nH]ccc5c4)c3c2)CC1
: