Target
Tissue alpha-L-fucosidase
Ligand
BDBM50442339
Substrate
Meas. Tech.
ChEMBL_990949 (CHEMBL2445277)
IC50
14±n/a nM
Citation
 Kato, AOkaki, TIfuku, SSato, KHirokami, YIwaki, RKamori, ANakagawa, SAdachi, IKiria, PGOnomura, OMinato, DSugimoto, KMatsuya, YToyooka, N Synthesis and biological evaluation of N-(2-fluorophenyl)-2ß-deoxyfuconojirimycin acetamide as a potent inhibitor fora-l-fucosidases. Bioorg Med Chem 21:6565-73 (2013)  
Target
Name:
Tissue alpha-L-fucosidase
Synonyms:
Alpha-L-fucosidase I FUCA1 Tissue alpha-L-fucosidase
Type:
PROTEIN
Mol. Mass.:
53690.69
Organism:
Homo sapiens (Human)
Description:
ChEMBL_34088
Residue:
466
  
Inhibitor
Name:
BDBM50442339
Synonyms:
CHEMBL2442788
Type:
Small organic molecule
Emp. Form.:
C14H19FN2O4
Mol. Mass.:
298.3101
SMILES:
C[C@@H]1N[C@H](CC(=O)Nc2ccc(F)cc2)[C@@H](O)[C@H](O)[C@@H]1O
: