Target
Neuropeptide Y receptor type 1
Ligand
BDBM50442546
Substrate
Meas. Tech.
ChEMBL_990502 (CHEMBL2446799)
Ki
86±n/a nM
Citation
 Keller, MKaske, MHolzammer, TBernhardt, GBuschauer, A Dimeric argininamide-type neuropeptide Y receptor antagonists: chiral discrimination between Y1 and Y4 receptors. Bioorg Med Chem 21:6303-22 (2013)  
Target
Name:
Neuropeptide Y receptor type 1
Synonyms:
NPY-Y1 NPY1R NPYR neuropeptide Y receptor Y1
Type:
Enzyme Catalytic Domain
Mol. Mass.:
44399.07
Organism:
Homo sapiens (Human)
Description:
NPY-Y1 NPY1R HUMAN::P25929
Residue:
384
  
Inhibitor
Name:
BDBM50442546
Synonyms:
CHEMBL2440902
Type:
Small organic molecule
Emp. Form.:
C41H56N12O7
Mol. Mass.:
828.9595
SMILES:
NCCC(=O)NCCNC(=O)CCC(=O)NCCNC(=O)NC(N)=NCCC[C@@H](NC(=O)C(c1ccccc1)c1ccccc1)C(=O)NCc1ccc(CNC(N)=O)cc1
: