Target
Serine/threonine-protein kinase N1
Ligand
BDBM50445473
Substrate
Meas. Tech.
ChEMBL_1284296 (CHEMBL3108317)
IC50
4480±n/a nM
Citation
 El Amrani, MLai, DDebbab, AAly, AHSiems, KSeidel, CSchnekenburger, MGaigneaux, ADiederich, MFeger, DLin, WProksch, P Protein kinase and HDAC inhibitors from the endophytic fungus Epicoccum nigrum. J Nat Prod 77:49-56 (2014)  
Target
Name:
Serine/threonine-protein kinase N1
Synonyms:
PAK1 PKN1 PRK1 Protein kinase N1 | Serine/threonine-protein kinase N1/Transforming protein RhoA
Type:
PROTEIN
Mol. Mass.:
103928.39
Organism:
Homo sapiens (Human)
Description:
ChEMBL_1433150
Residue:
942
  
Inhibitor
Name:
BDBM50445473
Synonyms:
CHEMBL3104851
Type:
Small organic molecule
Emp. Form.:
C18H14O9
Mol. Mass.:
374.2984
SMILES:
Cc1c(O)c(O)c2O[C@H]3O[C@H](C(=O)c4c(O)c(O)c(O)c(C)c34)c2c1C=O
: