Target
Leucine-rich repeat serine/threonine-protein kinase 2
Ligand
BDBM50448123
Substrate
Meas. Tech.
ChEMBL_1291901 (CHEMBL3124215)
IC50
42±n/a nM
Citation
 Estrada, AAChan, BKBaker-Glenn, CBeresford, ABurdick, DJChambers, MChen, HDominguez, SLDotson, JDrummond, JFlagella, MFuji, RGill, AHalladay, JHarris, SFHeffron, TPKleinheinz, TLee, DWLe Pichon, CELiu, XLyssikatos, JPMedhurst, ADMoffat, JGNash, KScearce-Levie, KSheng, ZShore, DGWong, SZhang, SZhang, XZhu, HSweeney, ZK Discovery of highly potent, selective, and brain-penetrant aminopyrazole leucine-rich repeat kinase 2 (LRRK2) small molecule inhibitors. J Med Chem 57:921-36 (2014)  
Target
Name:
Leucine-rich repeat serine/threonine-protein kinase 2
Synonyms:
Dardarin LRRK2_HUMAN Leucine-rich repeat serine/threonine-protein kinase 2 PARK8
Type:
Protein
Mol. Mass.:
286113.20
Organism:
Homo sapiens (Human)
Description:
Q5S007
Residue:
2527
  
Inhibitor
Name:
BDBM50448123
Synonyms:
CHEMBL3122108 | US9212186, 16
Type:
Small organic molecule
Emp. Form.:
C13H15F3N6O
Mol. Mass.:
328.293
SMILES:
CNc1nc(Nc2cnn3CCOC(C)c23)ncc1C(F)(F)F
: