Target
Cytochrome P450 1A2
Ligand
BDBM50448114
Substrate
Meas. Tech.
ChEMBL_1291756 (CHEMBL3124047)
IC50
2000±n/a nM
Citation
 Estrada, AAChan, BKBaker-Glenn, CBeresford, ABurdick, DJChambers, MChen, HDominguez, SLDotson, JDrummond, JFlagella, MFuji, RGill, AHalladay, JHarris, SFHeffron, TPKleinheinz, TLee, DWLe Pichon, CELiu, XLyssikatos, JPMedhurst, ADMoffat, JGNash, KScearce-Levie, KSheng, ZShore, DGWong, SZhang, SZhang, XZhu, HSweeney, ZK Discovery of highly potent, selective, and brain-penetrant aminopyrazole leucine-rich repeat kinase 2 (LRRK2) small molecule inhibitors. J Med Chem 57:921-36 (2014)  
Target
Name:
Cytochrome P450 1A2
Synonyms:
CP1A2_HUMAN CYPIA2 Cytochrome P(3)450 Cytochrome P450 1A2 (CYP1A2) Cytochrome P450-P3
Type:
Enzyme
Mol. Mass.:
58423.38
Organism:
Homo sapiens (Human)
Description:
P05177
Residue:
516
  
Inhibitor
Name:
BDBM50448114
Synonyms:
CHEMBL3122120
Type:
Small organic molecule
Emp. Form.:
C13H15F3N6O
Mol. Mass.:
328.293
SMILES:
CNc1nc(Nc2cnn(C3COC3)c2C)ncc1C(F)(F)F
: