Target
Dual specificity protein kinase TTK
Ligand
BDBM50448118
Substrate
Meas. Tech.
ChEMBL_1291900 (CHEMBL3124214)
Ki
150±n/a nM
Citation
 Estrada, AAChan, BKBaker-Glenn, CBeresford, ABurdick, DJChambers, MChen, HDominguez, SLDotson, JDrummond, JFlagella, MFuji, RGill, AHalladay, JHarris, SFHeffron, TPKleinheinz, TLee, DWLe Pichon, CELiu, XLyssikatos, JPMedhurst, ADMoffat, JGNash, KScearce-Levie, KSheng, ZShore, DGWong, SZhang, SZhang, XZhu, HSweeney, ZK Discovery of highly potent, selective, and brain-penetrant aminopyrazole leucine-rich repeat kinase 2 (LRRK2) small molecule inhibitors. J Med Chem 57:921-36 (2014)  
Target
Name:
Dual specificity protein kinase TTK
Synonyms:
Dual specificity protein kinase (TTK) MPS1 Monopolar Spindle 1 (MPS1) Monopolar Spindle 1 Kinase (MPS1) TTK | TTK_HUMAN
Type:
Protein
Mol. Mass.:
97086.79
Organism:
Homo sapiens (Human)
Description:
P33981
Residue:
857
  
Inhibitor
Name:
BDBM50448118
Synonyms:
CHEMBL3122113 US11111235, No. 80 US9932325, Example 80
Type:
Small organic molecule
Emp. Form.:
C14H16F3N7
Mol. Mass.:
339.3189
SMILES:
CNc1nc(Nc2cn(nc2C)C(C)(C)C#N)ncc1C(F)(F)F
: