Target
Beta-2 adrenergic receptor
Ligand
BDBM50002601
Substrate
Meas. Tech.
ChEMBL_352667 (CHEMBL862146)
EC50
1585±n/a nM
Citation
 Uehling, DEShearer, BGDonaldson, KHChao, EYDeaton, DNAdkison, KKBrown, KKCariello, NFFaison, WLLancaster, MELin, JHart, RMilliken, TOPaulik, MASherman, BWSugg, EECowan, C Biarylaniline phenethanolamines as potent and selective beta3 adrenergic receptor agonists. J Med Chem 49:2758-71 (2006)  
Target
Name:
Beta-2 adrenergic receptor
Synonyms:
ADRB2 ADRB2_HUMAN Beta-2 adrenoceptor | Beta-2 adrenoreceptor
Type:
Mol. Mass.:
46461.69
Organism:
Homo sapiens (Human)
Description:
P07550
Residue:
413
  
Inhibitor
Name:
BDBM50002601
Synonyms:
CHEMBL383511
Type:
Small organic molecule
Emp. Form.:
C24H25ClN2O3
Mol. Mass.:
424.92
SMILES:
C[C@H](CNc1cccc(c1)-c1ccc(cc1)C(O)=O)NC[C@H](O)c1cccc(Cl)c1
: