Target
Beta-3 adrenergic receptor
Ligand
BDBM50002609
Substrate
Meas. Tech.
ChEMBL_352666 (CHEMBL862145)
EC50
32±n/a nM
Citation
 Uehling, DEShearer, BGDonaldson, KHChao, EYDeaton, DNAdkison, KKBrown, KKCariello, NFFaison, WLLancaster, MELin, JHart, RMilliken, TOPaulik, MASherman, BWSugg, EECowan, C Biarylaniline phenethanolamines as potent and selective beta3 adrenergic receptor agonists. J Med Chem 49:2758-71 (2006)  
Target
Name:
Beta-3 adrenergic receptor
Synonyms:
ADRB3 ADRB3_HUMAN Beta-2 adrenergic receptor and beta-3 adrenergic receptor Beta-3 adrenoreceptor | adrenergic Beta3
Type:
G Protein-Coupled Receptor (GPCR)
Mol. Mass.:
43534.88
Organism:
Homo sapiens (Human)
Description:
Residue:
408
  
Inhibitor
Name:
BDBM50002609
Synonyms:
CHEMBL208328
Type:
Small organic molecule
Emp. Form.:
C23H24ClN3O3
Mol. Mass.:
425.908
SMILES:
C[C@H](CNc1cccc(c1)-c1ncccc1C(O)=O)NC[C@H](O)c1cccc(Cl)c1
: