Target
Acetylcholinesterase
Ligand
BDBM50005568
Substrate
Meas. Tech.
ChEMBL_1339053 (CHEMBL3243111)
Kd
50000±n/a nM
Citation
 Kliachyna, MSantoni, GNussbaum, VRenou, JSanson, BColletier, JPArboléas, MLoiodice, MWeik, MJean, LRenard, PYNachon, FBaati, R Design, synthesis and biological evaluation of novel tetrahydroacridine pyridine- aldoxime and -amidoxime hybrids as efficient uncharged reactivators of nerve agent-inhibited human acetylcholinesterase. Eur J Med Chem 78:455-67 (2014)  
Target
Name:
Acetylcholinesterase
Synonyms:
ACES_HUMAN Acetylcholinesterase (AChE) | Acetylcholinesterase (human AChE)
Type:
Enzyme
Mol. Mass.:
67792.70
Organism:
Homo sapiens (Human)
Description:
P22303
Residue:
614
  
Inhibitor
Name:
BDBM50005568
Synonyms:
CHEMBL141735 | CHEMBL3234584
Type:
Small organic molecule
Emp. Form.:
C15H18Cl2N4O2
Mol. Mass.:
357.235
SMILES:
[Cl-].[Cl-].NC(=O)c1cc[n+](CCC[n+]2ccccc2\C=N\O)cc1
: