Target
Arylamine N-acetyltransferase 1
Ligand
BDBM50014943
Substrate
Meas. Tech.
ChEMBL_1347886 (CHEMBL3267122)
IC50
2600±n/a nM
Citation
 Egleton, JEThinnes, CCSeden, PTLaurieri, NLee, SPHadavizadeh, KSMeasures, ARJones, AMThompson, SVarney, AWynne, GMRyan, ASim, ERussell, AJ Structure-activity relationships and colorimetric properties of specific probes for the putative cancer biomarker human arylamine N-acetyltransferase 1. Bioorg Med Chem 22:3030-54 (2014)  
Target
Name:
Arylamine N-acetyltransferase 1
Synonyms:
AAC1 NAT1
Type:
PROTEIN
Mol. Mass.:
33898.32
Organism:
Homo sapiens (Human)
Description:
ChEMBL_1347886
Residue:
290
  
Inhibitor
Name:
BDBM50014943
Synonyms:
CHEMBL3262084
Type:
Small organic molecule
Emp. Form.:
C24H21N3O4S
Mol. Mass.:
447.506
SMILES:
Cc1cc(C)cc(NC2=C(NS(=O)(=O)c3ccccc3)C(=O)c3cc(N)ccc3C2=O)c1
: