Target
Proton-coupled folate transporter
Ligand
BDBM50027656
Substrate
Meas. Tech.
ChEMBL_1431349 (CHEMBL3387475)
IC50
13±n/a nM
Citation
 Golani, LKGeorge, CZhao, SRaghavan, SOrr, SWallace, AWilson, MRHou, ZMatherly, LHGangjee, A Structure-activity profiles of novel 6-substituted pyrrolo[2,3-d]pyrimidine thienoyl antifolates with modified amino acids for cellular uptake by folate receptorsa andß and the proton-coupled folate transporter. J Med Chem 57:8152-66 (2014)  
Target
Name:
Proton-coupled folate transporter
Synonyms:
G21 Heme carrier protein 1 PCFT/HCP1 SLC46A1 | Solute carrier family 46 member 1
Type:
PROTEIN
Mol. Mass.:
49782.13
Organism:
Homo sapiens (Human)
Description:
ChEMBL_1469597
Residue:
459
  
Inhibitor
Name:
BDBM50027656
Synonyms:
CHEBI:63616 LY-231514 US9422297, Pemetrexed
Type:
Small organic molecule
Emp. Form.:
C20H21N5O6
Mol. Mass.:
427.4106
SMILES:
Nc1nc2[nH]cc(CCc3ccc(cc3)C(=O)N[C@@H](CCC(O)=O)C(O)=O)c2c(=O)[nH]1
: