Target
Bromodomain-containing protein 7
Ligand
BDBM50028142
Substrate
Meas. Tech.
ChEMBL_1434746 (CHEMBL3383415)
IC50
<1.3±n/a nM
Citation
 Gosmini, RNguyen, VLToum, JSimon, CBrusq, JMKrysa, GMirguet, ORiou-Eymard, AMBoursier, EVTrottet, LBamborough, PClark, HChung, CWCutler, LDemont, EHKaur, RLewis, AJSchilling, MBSoden, PETaylor, SWalker, ALWalker, MDPrinjha, RKNicodème, E The discovery of I-BET726 (GSK1324726A), a potent tetrahydroquinoline ApoA1 up-regulator and selective BET bromodomain inhibitor. J Med Chem 57:8111-31 (2014)  
Target
Name:
Bromodomain-containing protein 7
Synonyms:
75 kDa bromodomain protein BRD7 CELTIX1 | Protein CELTIX-1
Type:
PROTEIN
Mol. Mass.:
74135.71
Organism:
Homo sapiens (Human)
Description:
ChEMBL_107970
Residue:
651
  
Inhibitor
Name:
BDBM50028142
Synonyms:
CHEMBL2177300
Type:
Small organic molecule
Emp. Form.:
C25H23ClN2O3
Mol. Mass.:
434.915
SMILES:
C[C@H]1C[C@@H](Nc2ccc(Cl)cc2)c2cc(ccc2N1C(C)=O)-c1ccc(cc1)C(O)=O
: