Target
Lysosomal alpha-mannosidase
Ligand
BDBM50030339
Substrate
Meas. Tech.
ChEMBL_1432452 (CHEMBL3385734)
IC50
1826000±n/a nM
Citation
 Markad, PRSonawane, DPGhosh, SChopade, BAKumbhar, NLouat, THerman, JWaer, MHerdewijn, PDhavale, DD ¿-Hydroxyethyl piperidine iminosugar and N-alkylated derivatives: a study of their activity as glycosidase inhibitors and as immunosuppressive agents. Bioorg Med Chem 22:5776-82 (2014)  
Target
Name:
Lysosomal alpha-mannosidase
Synonyms:
LAMAN MAN2B1 | MANB
Type:
PROTEIN
Mol. Mass.:
113753.32
Organism:
Homo sapiens (Human)
Description:
ChEMBL_1432452
Residue:
1011
  
Inhibitor
Name:
BDBM50030339
Synonyms:
CHEMBL3344202
Type:
Small organic molecule
Emp. Form.:
C7H15NO4
Mol. Mass.:
177.1983
SMILES:
OCCC1(O)[C@@H](O)CNC[C@H]1O
: