Target
Apoptosis regulator Bcl-2
Ligand
BDBM50030749
Substrate
Meas. Tech.
ChEMBL_1437736 (CHEMBL3382383)
Ki
220±n/a nM
Target
Name:
Apoptosis regulator Bcl-2
Synonyms:
Apoptosis regulator Bcl-2 Protein BCL-2 BCL2_HUMAN | Bcl-2 Protein
Type:
Homodimer or heterodimer
Mol. Mass.:
26269.11
Organism:
Homo sapiens (Human)
Description:
P10415
Residue:
239
  
Inhibitor
Name:
BDBM50030749
Synonyms:
CHEMBL3342190
Type:
Small organic molecule
Emp. Form.:
C35H28N8O4S2
Mol. Mass.:
688.778
SMILES:
OC(=O)c1nc(sc1CCCOc1cccc(c1)-n1ncc2cncnc12)N1CCc2cccc(C(=O)Nc3nc4ccccc4s3)c2C1
: