Target
Collagenase 3
Ligand
BDBM50168737
Substrate
Meas. Tech.
ChEMBL_1435763 (CHEMBL3388955)
IC50
1.000000±n/a nM
Citation
 Durham, TBKlimkowski, VJRito, CJMarimuthu, JToth, JLLiu, CDurbin, JDStout, SLAdams, LSwearingen, CLin, CChambers, MGThirunavukkarasu, KWiley, MR Identification of potent and selective hydantoin inhibitors of aggrecanase-1 and aggrecanase-2 that are efficacious in both chemical and surgical models of osteoarthritis. J Med Chem 57:10476-85 (2014)  
Target
Name:
Collagenase 3
Synonyms:
MMP-13 MMP13_HUMAN Matrix metalloproteinase-13 (MMP-13) | Matrix metalloproteinase-13 (MMP13)
Type:
Enzyme
Mol. Mass.:
53808.06
Organism:
Homo sapiens (Human)
Description:
P45452
Residue:
471
  
Inhibitor
Name:
BDBM50168737
Synonyms:
(2R,3R)-1-[4-(2-Chloro-4-fluoro-benzyloxy)-benzenesulfonyl]-3-hydroxy-3-methyl-piperidine-2-carboxylic acid hydroxyamide | CHEMBL187092
Type:
Small organic molecule
Emp. Form.:
C20H22ClFN2O6S
Mol. Mass.:
472.915
SMILES:
C[C@@]1(O)CCCN([C@H]1C(=O)NO)S(=O)(=O)c1ccc(OCc2ccc(F)cc2Cl)cc1
: