Target
Potassium voltage-gated channel subfamily H member 2
Ligand
BDBM50034086
Substrate
Meas. Tech.
ChEMBL_1437210 (CHEMBL3382984)
IC50
950±n/a nM
Citation
 Lan, YChen, YCao, XZhang, JWang, JXu, XQiu, YZhang, TLiu, XLiu, BFZhang, G Synthesis and biological evaluation of novel sigma-1 receptor antagonists based on pyrimidine scaffold as agents for treating neuropathic pain. J Med Chem 57:10404-23 (2014)  
Target
Name:
Potassium voltage-gated channel subfamily H member 2
Synonyms:
1,3-beta-glucan synthase component GLS2 ERG Eag-related protein 1 Ether-a-go-go-related gene (HERG) Ether-a-go-go-related gene potassium channel 1 Ether-a-go-go-related gene potassium channel 1 (hERG1) Ether-a-go-go-related protein 1 H-ERG KCNH2 Potassium voltage-gated channel subfamily H member 2 (hERG) Voltage-gated potassium channel subunit Kv11.1 hERG Potassium Channel 1 | putative potassium channel subunit
Type:
Multi-pass membrane protein
Mol. Mass.:
126672.65
Organism:
Homo sapiens (Human)
Description:
Q12809
Residue:
1159
  
Inhibitor
Name:
BDBM50034086
Synonyms:
CHEMBL3359234
Type:
Small organic molecule
Emp. Form.:
C20H26ClN3O
Mol. Mass.:
359.893
SMILES:
Cc1ccc(cc1)-c1nc(C)c(Cl)c(OCCCN2CCCCC2)n1
: