Target
Carbonic anhydrase 5A, mitochondrial
Ligand
BDBM50040428
Substrate
Meas. Tech.
ChEMBL_1443935 (CHEMBL3374775)
Ki
124±n/a nM
Citation
 Ceruso, MAntel, SVullo, DScozzafava, ASupuran, CT Inhibition studies of new ureido-substituted sulfonamides incorporating a GABA moiety against human carbonic anhydrase isoforms I-XIV. Bioorg Med Chem 22:6768-75 (2015)  
Target
Name:
Carbonic anhydrase 5A, mitochondrial
Synonyms:
CA-VA CA5A Carbonate dehydratase VA Carbonic anhydrase 5A (CA VA) Carbonic anhydrase 5A, mitochondrial precursor Carbonic anhydrase VA (CA VA)
Type:
Enzyme
Mol. Mass.:
34755.54
Organism:
Homo sapiens (Human)
Description:
Human (cloned) isozyme
Residue:
305
  
Inhibitor
Name:
BDBM50040428
Synonyms:
CHEMBL3360591
Type:
Small organic molecule
Emp. Form.:
C19H23N5O6S
Mol. Mass.:
449.481
SMILES:
NS(=O)(=O)c1ccc(CCNC(=O)CCCNC(=O)Nc2ccc(cc2)[N+]([O-])=O)cc1
: