Target
Carbonic anhydrase 6
Ligand
BDBM50040425
Substrate
Meas. Tech.
ChEMBL_1443936 (CHEMBL3374776)
Ki
>120±n/a nM
Citation
 Ceruso, MAntel, SVullo, DScozzafava, ASupuran, CT Inhibition studies of new ureido-substituted sulfonamides incorporating a GABA moiety against human carbonic anhydrase isoforms I-XIV. Bioorg Med Chem 22:6768-75 (2015)  
Target
Name:
Carbonic anhydrase 6
Synonyms:
CA-VI CAH6_HUMAN Carbonic Anhydrase VI Carbonic anhydrase 6 Carbonic anhydrase 6 (CA-VI) Salivary carbonic anhydrase | Secreted carbonic anhydrase
Type:
Enzyme
Mol. Mass.:
35371.40
Organism:
Homo sapiens (Human)
Description:
P23280
Residue:
308
  
Inhibitor
Name:
BDBM50040425
Synonyms:
CHEMBL3360588
Type:
Small organic molecule
Emp. Form.:
C19H24N4O4S
Mol. Mass.:
404.483
SMILES:
NS(=O)(=O)c1ccc(CNC(=O)CCCNC(=O)NCc2ccccc2)cc1
: