Target
Carbonic anhydrase 9
Ligand
BDBM50040428
Substrate
Meas. Tech.
ChEMBL_1443938 (CHEMBL3374778)
Ki
139±n/a nM
Citation
 Ceruso, MAntel, SVullo, DScozzafava, ASupuran, CT Inhibition studies of new ureido-substituted sulfonamides incorporating a GABA moiety against human carbonic anhydrase isoforms I-XIV. Bioorg Med Chem 22:6768-75 (2015)  
Target
Name:
Carbonic anhydrase 9
Synonyms:
CA-IX CAH9_HUMAN Carbonic anhydrase 9 (CA IX) Carbonic anhydrase 9 precursor Carbonic anhydrase IX (CAIX) Carbonic anhydrases; II & IX MN RCC-associated antigen G250
Type:
Enzyme
Mol. Mass.:
49669.03
Organism:
Homo sapiens (Human)
Description:
Catalytic domain of human cloned isozyme was used in the assay
Residue:
459
  
Inhibitor
Name:
BDBM50040428
Synonyms:
CHEMBL3360591
Type:
Small organic molecule
Emp. Form.:
C19H23N5O6S
Mol. Mass.:
449.481
SMILES:
NS(=O)(=O)c1ccc(CCNC(=O)CCCNC(=O)Nc2ccc(cc2)[N+]([O-])=O)cc1
: