Target
Carbonic anhydrase 12
Ligand
BDBM50040429
Substrate
Meas. Tech.
ChEMBL_1443939 (CHEMBL3374779)
Ki
44±n/a nM
Citation
 Ceruso, MAntel, SVullo, DScozzafava, ASupuran, CT Inhibition studies of new ureido-substituted sulfonamides incorporating a GABA moiety against human carbonic anhydrase isoforms I-XIV. Bioorg Med Chem 22:6768-75 (2015)  
Target
Name:
Carbonic anhydrase 12
Synonyms:
CA-XII CAH12_HUMAN Carbonic anhydrase Carbonic anhydrase XII Carbonic anhydrase XII (CAXII) | Tumor antigen HOM-RCC-3.1.3
Type:
Enzyme
Mol. Mass.:
39456.00
Organism:
Homo sapiens (Human)
Description:
Catalytic domain of human cloned isozyme was used in the assay
Residue:
354
  
Inhibitor
Name:
BDBM50040429
Synonyms:
CHEMBL3360590
Type:
Small organic molecule
Emp. Form.:
C20H26N4O4S
Mol. Mass.:
418.51
SMILES:
NS(=O)(=O)c1ccc(CNC(=O)CCCNC(=O)NCCc2ccccc2)cc1
: