Target
Carbonic anhydrase 14
Ligand
BDBM50040430
Substrate
Meas. Tech.
ChEMBL_1443941 (CHEMBL3374781)
Ki
71±n/a nM
Citation
 Ceruso, MAntel, SVullo, DScozzafava, ASupuran, CT Inhibition studies of new ureido-substituted sulfonamides incorporating a GABA moiety against human carbonic anhydrase isoforms I-XIV. Bioorg Med Chem 22:6768-75 (2015)  
Target
Name:
Carbonic anhydrase 14
Synonyms:
CA-XIV CAH14_HUMAN Carbonic Anhydrase XIV Carbonic anhydrase 14 Carbonic anhydrase XIV (CA XIV)
Type:
Enzyme
Mol. Mass.:
37665.67
Organism:
Homo sapiens (Human)
Description:
Human (cloned) isozyme.
Residue:
337
  
Inhibitor
Name:
BDBM50040430
Synonyms:
CHEMBL3360589
Type:
Small organic molecule
Emp. Form.:
C20H26N4O4S
Mol. Mass.:
418.51
SMILES:
NS(=O)(=O)c1ccc(CCNC(=O)CCCNC(=O)NCc2ccccc2)cc1
: