Target
Cannabinoid receptor 1
Ligand
BDBM50042917
Substrate
Meas. Tech.
ChEMBL_1444652 (CHEMBL3376650)
EC50
>20000±n/a nM
Citation
 Bartolozzi, ACirillo, PFBerry, AKHickey, ERThomson, DSWu, LZindell, RAlbrecht, CCeci, AGemkow, MJNagaraja, NVRomig, HSauer, ARiether, D Selective CB2 receptor agonists. Part 3: the optimization of a piperidine-based series that demonstrated efficacy in an in vivo neuropathic pain model. Bioorg Med Chem Lett 25:587-92 (2015)  
Target
Name:
Cannabinoid receptor 1
Synonyms:
CANN6 CB-R CNR CNR1_HUMAN Cannabinoid receptor Cannabinoid receptor 1 (brain)
Type:
G Protein-Coupled Receptor (GPCR)
Mol. Mass.:
52868.96
Organism:
Homo sapiens (Human)
Description:
P21554
Residue:
472
  
Inhibitor
Name:
BDBM50042917
Synonyms:
CHEMBL3354548
Type:
Small organic molecule
Emp. Form.:
C20H31N5O4
Mol. Mass.:
405.4912
SMILES:
CC(=O)N1CCN(CC1)C(=O)N1CCCC[C@H]1C(=O)Nc1cc(on1)C(C)(C)C
: