Target
Farnesyl pyrophosphate synthase
Ligand
BDBM36503
Substrate
Meas. Tech.
ChEMBL_1454339 (CHEMBL3364478)
IC50
>500000000±n/a nM
Citation
 Abet, VMariani, ATruscott, FRBritton, SRodriguez, R Biased and unbiased strategies to identify biologically active small molecules. Bioorg Med Chem 22:4474-89 (2014)  
Target
Name:
Farnesyl pyrophosphate synthase
Synonyms:
Dimethylallyltranstransferase FPP synthase FPPS_HUMAN Farnesyl diphosphate synthase Farnesyl diphosphate synthetase Farnesyl pyrophosphate synthetase KIAA1293 | P14324
Type:
Enzyme
Mol. Mass.:
48272.89
Organism:
Homo sapiens (Human)
Description:
P14324
Residue:
419
  
Inhibitor
Name:
BDBM36503
Synonyms:
(S)-1-((Benzyloxy)carbonyl)indoline-2-carboxylic acid, 4 | CID6932064
Type:
Small organic molecule
Emp. Form.:
C17H15NO4
Mol. Mass.:
297.3053
SMILES:
OC(=O)[C@@H]1Cc2ccccc2N1C(=O)OCc1ccccc1
: