Target
RAC-alpha serine/threonine-protein kinase
Ligand
BDBM50044550
Substrate
Meas. Tech.
ChEMBL_1454330 (CHEMBL3364170)
Kd
200±n/a nM
Citation
 Abet, VMariani, ATruscott, FRBritton, SRodriguez, R Biased and unbiased strategies to identify biologically active small molecules. Bioorg Med Chem 22:4474-89 (2014)  
Target
Name:
RAC-alpha serine/threonine-protein kinase
Synonyms:
AKT phosphorylation (p-AKT) AKT1/PPP1CA C-AKT PKB alpha Protein kinase B Protein kinase B (Akt 1) Protein kinase B alpha Proto-oncogene Akt (Akt1) Proto-oncogene c-Akt (AKT1) RAC-PK-alpha RAC-alpha serine/threonine-protein kinase (AKT1) | RAC-alpha serine/threonine-protein kinase (pAKT)
Type:
Enzyme
Mol. Mass.:
55681.25
Organism:
Homo sapiens (Human)
Description:
P31749
Residue:
480
  
Inhibitor
Name:
BDBM50044550
Synonyms:
CHEMBL3314097
Type:
Small organic molecule
Emp. Form.:
C165H244N48O30S
Mol. Mass.:
3412.071
SMILES:
[H][C@@]12CS[C@H](CCCCC(=O)NCCNC(=O)[C@H](Cc3ccc(O)cc3)NC(=O)CNC(=O)[C@H](CC(C)C)NC(=O)[C@H](CCCNC(N)=N)NC(=O)[C@H](Cc3ccc(O)cc3)NC(=O)[C@H](Cc3ccccc3)NC(=O)[C@@H](NC(=O)C(CCCCCCCCn3cc(C[C@H](NC(C)=O)C(=O)N[C@@H](Cc4ccccc4)C(=O)N[C@@H](Cc4c[nH]c5ccccc45)C(=O)N[C@@H](Cc4ccccc4)C(=O)N[C@@H](CC(C)C)C(=O)N[C@@H](CCCNC(N)=N)C(=O)NCC(N)=O)nn3)NC(=O)CCCc3cn(CCCCCCCCC(NC(C)=O)C(=O)N[C@@H](CCCNC(N)=N)C(=O)N[C@@H](Cc4cnc[nH]4)C(=O)N[C@@H](CCC(O)=O)C(=O)N[C@@H](CCCNC(N)=N)C(=O)N[C@@H]([C@@H](C)CC)C(N)=O)nn3)C(C)C)[C@]1([H])NC(=O)N2
: