Target
Sphingosine 1-phosphate receptor 3
Ligand
BDBM23165
Substrate
Meas. Tech.
ChEMBL_1458116 (CHEMBL3367913)
EC50
2.0±n/a nM
Citation
 Tsuji, TSuzuki, KNakamura, TGoto, TSekiguchi, YIkeda, TFukuda, TTakemoto, TMizuno, YKimura, TKawase, YNara, FKagari, TShimozato, TYahara, CInaba, SHonda, TIzumi, TTamura, MNishi, T Synthesis and SAR studies of benzyl ether derivatives as potent orally active S1P1 agonists. Bioorg Med Chem 22:4246-56 (2014)  
Target
Name:
Sphingosine 1-phosphate receptor 3
Synonyms:
C9orf108 EDG3 S1P receptor 3 S1P3 S1PR3_HUMAN Sphingosine 1-phosphate receptor 3 (S1P3) | Sphingosine 1-phosphate receptor Edg-3
Type:
G Protein-Coupled Receptor (GPCR)
Mol. Mass.:
42278.13
Organism:
Homo sapiens (Human)
Description:
Q99500
Residue:
378
  
Inhibitor
Name:
BDBM23165
Synonyms:
CHEMBL366208 [(2S)-2-amino-3-hydroxy-2-[2-(4-octylphenyl)ethyl]propoxy]phosphonic acid
Type:
Small organic molecule
Emp. Form.:
C19H34NO5P
Mol. Mass.:
387.4507
SMILES:
CCCCCCCCc1ccc(CC[C@](N)(CO)COP(O)(O)=O)cc1
: