Target
Gamma-aminobutyric acid receptor subunit alpha-3/beta-2/gamma-2
Ligand
BDBM24183
Substrate
Meas. Tech.
ChEMBL_1456659 (CHEMBL3370259)
EC50
920±n/a nM
Citation
 Petersen, JGSørensen, TDamgaard, MNielsen, BJensen, AABalle, TBergmann, RFrølund, B Synthesis and pharmacological evaluation of 6-aminonicotinic acid analogues as novel GABA(A) receptor agonists. Eur J Med Chem 84:404-16 (2014)  
Target
Name:
Gamma-aminobutyric acid receptor subunit alpha-3/beta-2/gamma-2
Synonyms:
GABA A receptor alpha-3/beta-2/gamma-2 | GABA receptor alpha-3/beta-2/gamma-2 subunit
Type:
Mol. Mass.:
Description:
ASSAY_ID of EBI is 69791
Components:
This complex has 3 components.
Component 1
Name:
Gamma-aminobutyric acid receptor subunit gamma-2
Synonyms:
GABA(A) receptor subunit gamma-2 GBRG2_HUMAN
Type:
PROTEIN
Mol. Mass.:
54172.74
Organism:
Homo sapiens (Human)
Description:
EBI_217
Residue:
467
  
Component 2
Name:
Gamma-aminobutyric acid receptor subunit beta-2
Synonyms:
GABA(A) receptor subunit beta-2 GBRB2_HUMAN
Type:
PROTEIN
Mol. Mass.:
59167.91
Organism:
Homo sapiens (Human)
Description:
EBI_221
Residue:
512
  
Component 3
Name:
Gamma-aminobutyric acid receptor subunit alpha-3
Synonyms:
GABA A Alpha3Beta3Gamma2 GABA C GABA-A receptor GBRA3_HUMAN agonist GABA site
Type:
Enzyme Catalytic Domain
Mol. Mass.:
55175.47
Organism:
Homo sapiens (Human)
Description:
GABA A Alpha3Beta1Gamma2 0 HUMAN::P34903
Residue:
492
  
Component 4
Name:
Gamma-aminobutyric acid receptor subunit beta-2
Synonyms:
GABA(A) receptor subunit beta-2 GBRB2_HUMAN
Type:
PROTEIN
Mol. Mass.:
59167.91
Organism:
Homo sapiens (Human)
Description:
EBI_221
Residue:
512
  
Inhibitor
Name:
BDBM24183
Synonyms:
4-amino-n-[2,3-3H]butyric acid Aminalon GABA [3H]GABA | cid_119
Type:
Radiolabeled ligand
Emp. Form.:
C4H9NO2
Mol. Mass.:
103.1198
SMILES:
NCCCC(O)=O
: