Target
Tyrosine-protein kinase ITK/TSK
Ligand
BDBM50062938
Substrate
Meas. Tech.
ChEMBL_1463282 (CHEMBL3399471)
IC50
5.0±n/a nM
Citation
 Durham, TBBlanco, MJ Target engagement in lead generation. Bioorg Med Chem Lett 25:998-1008 (2015)  
Target
Name:
Tyrosine-protein kinase ITK/TSK
Synonyms:
EMT ITK_HUMAN LYK Tyrosine-protein kinase ITK Tyrosine-protein kinase Lyk
Type:
Protein
Mol. Mass.:
71839.20
Organism:
Homo sapiens (Human)
Description:
Q08881
Residue:
620
  
Inhibitor
Name:
BDBM50062938
Synonyms:
CHEMBL3397909 | N-[(3S)-1-Acryloyl-3-pyrrolidinyl]-N'-[1,3]thiazolo[5,4-b]pyridin-2-yl-4-({[(1S)-1,2,2-trimethylpropyl]amino}methyl)-2,6-pyridinediamine (12)
Type:
Small organic molecule
Emp. Form.:
C25H33N7OS
Mol. Mass.:
479.641
SMILES:
C[C@H](NCc1cc(N[C@H]2CCN(C2)C(=O)C=C)nc(Nc2nc3cccnc3s2)c1)C(C)(C)C
: