Target
Bromodomain-containing protein 4
Ligand
BDBM50071189
Substrate
Meas. Tech.
ChEMBL_1469310 (CHEMBL3414207)
IC50
>10000±n/a nM
Citation
 Zhao, LWang, YCao, DChen, TWang, QLi, YXu, YZhang, NWang, XChen, DChen, LChen, YLXia, GShi, ZLiu, YCLin, YMiao, ZShen, JXiong, B Fragment-based drug discovery of 2-thiazolidinones as BRD4 inhibitors: 2. Structure-based optimization. J Med Chem 58:1281-97 (2015)  
Target
Name:
Bromodomain-containing protein 4
Synonyms:
BRD4 Bromodomain-containing protein 4 (BRD4) Protein HUNK1
Type:
Protein
Mol. Mass.:
152264.84
Organism:
Homo sapiens (Human)
Description:
O60885
Residue:
1362
  
Inhibitor
Name:
BDBM50071189
Synonyms:
CHEMBL3409989
Type:
Small organic molecule
Emp. Form.:
C15H14N2O3S3
Mol. Mass.:
366.478
SMILES:
O=c1[nH]c(cs1)-c1cccc(c1)S(=O)(=O)NCCc1cccs1
: