Target
Dihydroorotate dehydrogenase (quinone), mitochondrial
Ligand
BDBM50071788
Substrate
Meas. Tech.
ChEMBL_1470241 (CHEMBL3413103)
IC50
562±n/a nM
Citation
 Zhu, JHan, LDiao, YRen, XXu, MXu, LLi, SLi, QDong, DHuang, JLiu, XZhao, ZWang, RZhu, LXu, YQian, XLi, H Design, synthesis, X-ray crystallographic analysis, and biological evaluation of thiazole derivatives as potent and selective inhibitors of human dihydroorotate dehydrogenase. J Med Chem 58:1123-39 (2015)  
Target
Name:
Dihydroorotate dehydrogenase (quinone), mitochondrial
Synonyms:
DHODH Dihydroorotate dehydrogenase Dihydroorotate dehydrogenase, mitochondrial Dihydroorotate oxidase (DHODH) | PYRD_HUMAN
Type:
Enzyme
Mol. Mass.:
42881.33
Organism:
Homo sapiens (Human)
Description:
Q02127
Residue:
395
  
Inhibitor
Name:
BDBM50071788
Synonyms:
CHEMBL3410576
Type:
Small organic molecule
Emp. Form.:
C16H14N2OS
Mol. Mass.:
282.36
SMILES:
CC(=O)c1sc(Nc2ccc3ccccc3c2)nc1C
: