Target
LIM domain kinase 1
Ligand
BDBM50072668
Substrate
Meas. Tech.
ChEMBL_1467118 (CHEMBL3411315)
IC50
190±n/a nM
Citation
 Yin, YZheng, KEid, NHoward, SJeong, JHYi, FGuo, JPark, CMBibian, MWu, WHernandez, PPark, HWu, YLuo, JLLoGrasso, PVFeng, Y Bis-aryl urea derivatives as potent and selective LIM kinase (Limk) inhibitors. J Med Chem 58:1846-61 (2015)  
Target
Name:
LIM domain kinase 1
Synonyms:
LIM domain kinase 1 LIMK1_RAT Limk1
Type:
PROTEIN
Mol. Mass.:
72598.76
Organism:
Rattus norvegicus
Description:
ChEMBL_109573
Residue:
647
  
Inhibitor
Name:
BDBM50072668
Synonyms:
CHEMBL3410045
Type:
Small organic molecule
Emp. Form.:
C23H23N5O2
Mol. Mass.:
401.461
SMILES:
Cc1c[nH]c2ncnc(-c3ccc(NC(=O)N(CCO)c4ccc(C)cc4)cc3)c12
: