Target
LIM domain kinase 1
Ligand
BDBM50072829
Substrate
Meas. Tech.
ChEMBL_1467101 (CHEMBL3411298)
IC50
86±n/a nM
Citation
 Yin, YZheng, KEid, NHoward, SJeong, JHYi, FGuo, JPark, CMBibian, MWu, WHernandez, PPark, HWu, YLuo, JLLoGrasso, PVFeng, Y Bis-aryl urea derivatives as potent and selective LIM kinase (Limk) inhibitors. J Med Chem 58:1846-61 (2015)  
Target
Name:
LIM domain kinase 1
Synonyms:
LIMK LIMK1 | LIMK1_HUMAN
Type:
Enzyme Catalytic Domain
Mol. Mass.:
72591.81
Organism:
Homo sapiens (Human)
Description:
gi_4505001
Residue:
647
  
Inhibitor
Name:
BDBM50072829
Synonyms:
CHEMBL3410039
Type:
Small organic molecule
Emp. Form.:
C22H20FN5O2
Mol. Mass.:
405.4249
SMILES:
Cc1c[nH]c2ncnc(-c3ccc(NC(=O)N(CCO)c4ccc(F)cc4)cc3)c12
: