Target
Acetylcholinesterase
Ligand
BDBM50080392
Substrate
Meas. Tech.
ChEMBL_1471374 (CHEMBL3419222)
Ki
270±n/a nM
Citation
 Pourshojaei, YGouranourimi, AHekmat, SAsadipour, ARahmani-Nezhad, SMoradi, ANadri, HMoghadam, FHEmami, SForoumadi, AShafiee, A Design, synthesis and anticholinesterase activity of novel benzylidenechroman-4-ones bearing cyclic amine side chain. Eur J Med Chem 97:181-9 (2015)  
Target
Name:
Acetylcholinesterase
Synonyms:
ACES_ELEEL Acetylcholinesterase (EeAChE) | ache
Type:
Enzyme
Mol. Mass.:
71812.79
Organism:
Electrophorus electricus (Electric eel)
Description:
Residue:
633
  
Inhibitor
Name:
BDBM50080392
Synonyms:
CHEMBL3416513
Type:
Small organic molecule
Emp. Form.:
C25H30ClNO4
Mol. Mass.:
443.963
SMILES:
Cl.CCOc1ccc2C(=O)\C(COc2c1)=C\c1ccc(OCCN2CCCCC2)cc1
: