Target
Cytochrome P450 11B1, mitochondrial
Ligand
BDBM50092187
Substrate
Meas. Tech.
ChEMBL_1498858 (CHEMBL3583832)
IC50
225±n/a nM
Target
Name:
Cytochrome P450 11B1, mitochondrial
Synonyms:
C11B1_HUMAN CYPXIB1 Cytochrome P450 11B1 Cytochrome P450 11B1, mitochondrial | S11BH
Type:
Enzyme
Mol. Mass.:
57591.44
Organism:
Homo sapiens (Human)
Description:
P15538
Residue:
503
  
Inhibitor
Name:
BDBM50092187
Synonyms:
CHEMBL3582476
Type:
Small organic molecule
Emp. Form.:
C16H10F2N4
Mol. Mass.:
296.2742
SMILES:
Fc1cncc(c1)-c1nc2cc(F)c(cc2n1C1CC1)C#N
: