Target
Acetylcholinesterase
Ligand
BDBM50093085
Substrate
Meas. Tech.
ChEMBL_1502006 (CHEMBL3588490)
Ki
80±n/a nM
Citation
 Farina, RPisani, LCatto, MNicolotti, OGadaleta, DDenora, NSoto-Otero, RMendez-Alvarez, EPassos, CSMuncipinto, GAltomare, CDNurisso, ACarrupt, PACarotti, A Structure-Based Design and Optimization of Multitarget-Directed 2H-Chromen-2-one Derivatives as Potent Inhibitors of Monoamine Oxidase B and Cholinesterases. J Med Chem 58:5561-78 (2015)  
Target
Name:
Acetylcholinesterase
Synonyms:
ACES_ELEEL Acetylcholinesterase (EeAChE) | ache
Type:
Enzyme
Mol. Mass.:
71812.79
Organism:
Electrophorus electricus (Electric eel)
Description:
Residue:
633
  
Inhibitor
Name:
BDBM50093085
Synonyms:
CHEMBL3586582
Type:
Small organic molecule
Emp. Form.:
C25H31NO3
Mol. Mass.:
393.5185
SMILES:
CN(CCCCCCOc1ccc2c(C)c(C)c(=O)oc2c1)Cc1ccccc1
: