Target
Activin receptor type-1
Ligand
BDBM50097393
Substrate
Meas. Tech.
ChEMBL_1501908 (CHEMBL3588248)
IC50
7.0±n/a nM
Citation
 Smith, CRDougan, DRKomandla, MKanouni, TKnight, BLawson, JDSabat, MTaylor, ERVu, PWyrick, C Fragment-Based Discovery of a Small Molecule Inhibitor of Bruton's Tyrosine Kinase. J Med Chem 58:5437-44 (2015)  
Target
Name:
Activin receptor type-1
Synonyms:
2.7.11.30 ACVR1 ACVRLK2 ALK2/ACVR1 Activin receptor-like kinase 2 Activin receptor-like kinase 2 (ALK2/ACVR1) SKR1 TGF-B superfamily receptor type I | TSR-I
Type:
Mol. Mass.:
57158.32
Organism:
Homo sapiens (Human)
Description:
Residue:
509
  
Inhibitor
Name:
BDBM50097393
Synonyms:
CHEMBL3586447
Type:
Small organic molecule
Emp. Form.:
C17H14N6O
Mol. Mass.:
318.3327
SMILES:
Cc1cc2cn[nH]c2cc1-c1cccc2c(N)c(nnc12)C(N)=O
: