Target
Kappa-type opioid receptor
Ligand
BDBM50012477
Substrate
Meas. Tech.
ChEMBL_1456843 (CHEMBL3367576)
Ki
43±n/a nM
Citation
 Weltrowska, GLemieux, CChung, NNGuo, JJWilkes, BCSchiller, PW 'Carba'-carfentanil (trans isomer): aµ opioid receptor (MOR) partial agonist with a distinct binding mode. Bioorg Med Chem 22:4581-6 (2014)  
Target
Name:
Kappa-type opioid receptor
Synonyms:
Kappa Opioid Receptor OPRK1 Opiate Kappa 1 | mu/kappa opioid receptor
Type:
G Protein-Coupled Receptor (GPCR)
Mol. Mass.:
42744.99
Organism:
Cavia porcellus (domestic guinea pig)
Description:
P41144
Residue:
380
  
Inhibitor
Name:
BDBM50012477
Synonyms:
1-Phenethyl-4-(phenyl-propionyl-amino)-piperidine-4-carboxylic acid methyl ester CARFENTANIL Carfentanil1-Phenethyl-4-(phenyl-propionyl-amino)-piperidine-4-carboxylic acid methyl ester | US20230399418, Compound Carfentanil
Type:
Small organic molecule
Emp. Form.:
C24H30N2O3
Mol. Mass.:
394.5066
SMILES:
CCC(=O)N(c1ccccc1)C1(CCN(CCc2ccccc2)CC1)C(=O)OC
: