Target
Substance-P receptor
Ligand
BDBM50106356
Substrate
Meas. Tech.
ChEMBL_1506667 (CHEMBL3598619)
IC50
0.590000±n/a nM
Citation
 Degnan, APTora, GOHan, YRajamani, RBertekap, RKrause, RDavis, CDHu, JMorgan, DTaylor, SJKrause, KLi, YWMattson, GCunningham, MATaber, MTLodge, NJBronson, JJGillman, KWMacor, JE Biaryls as potent, tunable dual neurokinin 1 receptor antagonists and serotonin transporter inhibitors. Bioorg Med Chem Lett 25:3039-43 (2015)  
Target
Name:
Substance-P receptor
Synonyms:
NK-1 receptor NK1 Receptor NK1R_HUMAN Neurokinin-1 (NK-1) SPR TACR1 Tachykinin receptor 1 (NK1) | tachykinin
Type:
G Protein-Coupled Receptor (GPCR)
Mol. Mass.:
46254.43
Organism:
Homo sapiens (Human)
Description:
P25103
Residue:
407
  
Inhibitor
Name:
BDBM50106356
Synonyms:
CHEMBL3596483
Type:
Small organic molecule
Emp. Form.:
C27H25F3N2O
Mol. Mass.:
450.4954
SMILES:
FC(F)(F)c1cc(COCC2(CCNCC2)c2ccccc2)cc(c1)-c1ccc(cc1)C#N
: