Target
Acetylcholinesterase
Ligand
BDBM50005579
Substrate
Meas. Tech.
ChEMBL_1507810 (CHEMBL3598674)
Kd
19500±n/a nM
Citation
 Valiveti, AKBhalerao, UMAcharya, JKarade, HNAcharya, BNRaviraju, GHalve, AKKaushik, MP Synthesis and in vitro kinetic evaluation of N-thiazolylacetamido monoquaternary pyridinium oximes as reactivators of sarin, O-ethylsarin and VX inhibited human acetylcholinesterase (hAChE). Bioorg Med Chem 23:4899-910 (2015)  
Target
Name:
Acetylcholinesterase
Synonyms:
ACES_HUMAN Acetylcholinesterase (AChE) | Acetylcholinesterase (human AChE)
Type:
Enzyme
Mol. Mass.:
67792.70
Organism:
Homo sapiens (Human)
Description:
P22303
Residue:
614
  
Inhibitor
Name:
BDBM50005579
Synonyms:
CHEMBL139148 | Obidoxime
Type:
Small organic molecule
Emp. Form.:
C14H16N4O3
Mol. Mass.:
288.3007
SMILES:
O\N=C\c1cc[n+](COC[n+]2ccc(\C=N\O)cc2)cc1
: