Target
Carbonic anhydrase 14
Ligand
BDBM50117672
Substrate
Meas. Tech.
ChEMBL_1515209 (CHEMBL3614556)
Ki
39±n/a nM
Citation
 Buemi, MRDe Luca, LFerro, SBruno, ECeruso, MSupuran, CTPospí?ilová, KBrynda, JRezácová, PGitto, R Carbonic anhydrase inhibitors: Design, synthesis and structural characterization of new heteroaryl-N-carbonylbenzenesulfonamides targeting druggable human carbonic anhydrase isoforms. Eur J Med Chem 102:223-32 (2015)  
Target
Name:
Carbonic anhydrase 14
Synonyms:
CA-XIV CAH14_HUMAN Carbonic Anhydrase XIV Carbonic anhydrase 14 Carbonic anhydrase XIV (CA XIV)
Type:
Enzyme
Mol. Mass.:
37665.67
Organism:
Homo sapiens (Human)
Description:
Human (cloned) isozyme.
Residue:
337
  
Inhibitor
Name:
BDBM50117672
Synonyms:
CHEMBL3613783
Type:
Small organic molecule
Emp. Form.:
C16H16N2O3S
Mol. Mass.:
316.375
SMILES:
NS(=O)(=O)c1ccc(cc1)C(=O)N1CCCc2ccccc12
: