Target
Carbonic anhydrase 12
Ligand
BDBM50133393
Substrate
Meas. Tech.
ChEMBL_1525821 (CHEMBL3635735)
Ki
26±n/a nM
Citation
 La Regina, GColuccia, AFamiglini, VPelliccia, SMonti, LVullo, DNuti, EAlterio, VDe Simone, GMonti, SMPan, PParkkila, SSupuran, CTRossello, ASilvestri, R Discovery of 1,1'-Biphenyl-4-sulfonamides as a New Class of Potent and Selective Carbonic Anhydrase XIV Inhibitors. J Med Chem 58:8564-72 (2015)  
Target
Name:
Carbonic anhydrase 12
Synonyms:
CA-XII CAH12_HUMAN Carbonic anhydrase Carbonic anhydrase XII Carbonic anhydrase XII (CAXII) | Tumor antigen HOM-RCC-3.1.3
Type:
Enzyme
Mol. Mass.:
39456.00
Organism:
Homo sapiens (Human)
Description:
Catalytic domain of human cloned isozyme was used in the assay
Residue:
354
  
Inhibitor
Name:
BDBM50133393
Synonyms:
CHEMBL3632829
Type:
Small organic molecule
Emp. Form.:
C15H16N2O4S
Mol. Mass.:
320.364
SMILES:
NS(=O)(=O)c1ccc(cc1)-c1ccc(cc1)C(=O)NCCO
: