Target
Adenosine receptor A2a
Ligand
BDBM50139769
Substrate
Meas. Tech.
ChEBML_1553861
Ki
86±n/a nM
Citation
 Zhou, GAslanian, RGallo, GKhan, TKuang, RPurakkattle, BDe Ruiz, MStamford, ATing, PWu, HWang, HXiao, DYu, TZhang, YMullins, DHodgson, R Discovery of aminoquinazoline derivatives as human A(2A) adenosine receptor antagonists. Bioorg Med Chem Lett 26:1348-54 (2016)  
Target
Name:
Adenosine receptor A2a
Synonyms:
A2A adenosine receptor (hA2A) ADENOSINE A2 ADORA2 Adenosine A2A receptor (A2AAR)
Type:
G Protein-Coupled Receptor (GPCR)
Mol. Mass.:
44716.46
Organism:
Homo sapiens (Human)
Description:
P29274
Residue:
412
  
Inhibitor
Name:
BDBM50139769
Synonyms:
CHEMBL3764006 | US10138212, Example 95
Type:
Small organic molecule
Emp. Form.:
C20H17N5O3S
Mol. Mass.:
407.446
SMILES:
CS(=O)(=O)c1cccc2c(nc(N)nc12)C(=O)NCc1cccc2cccnc12
: