Target
Carbonic anhydrase 2
Ligand
BDBM50146599
Substrate
Meas. Tech.
ChEMBL_1555757 (CHEMBL3766368)
Ki
0.980000±n/a nM
Citation
 Cornelio, BLaronze-Cochard, MCeruso, MFerraroni, MRance, GACarta, FKhlobystov, ANFontana, ASupuran, CTSapi, J 4-Arylbenzenesulfonamides as Human Carbonic Anhydrase Inhibitors (hCAIs): Synthesis by Pd Nanocatalyst-Mediated Suzuki-Miyaura Reaction, Enzyme Inhibition, and X-ray Crystallographic Studies. J Med Chem 59:721-32 (2016)  
Target
Name:
Carbonic anhydrase 2
Synonyms:
CA-II CAC Carbonate dehydratase II Carbonic anhydrase 2 (CA-II) Carbonic anhydrase C Carbonic anhydrase II (CA-II) Carbonic anhydrase II (hCA II) | Carbonic anhydrase isoenzyme II (hCA II)
Type:
Enzyme
Mol. Mass.:
29250.71
Organism:
Homo sapiens (Human)
Description:
P00918
Residue:
260
  
Inhibitor
Name:
BDBM50146599
Synonyms:
CHEMBL3763192
Type:
Small organic molecule
Emp. Form.:
C15H17NO2S
Mol. Mass.:
275.366
SMILES:
CC(C)c1ccccc1-c1ccc(cc1)S(N)(=O)=O
: