Target
Carbonic anhydrase 12
Ligand
BDBM50147762
Substrate
Meas. Tech.
ChEMBL_1555890 (CHEMBL3767107)
Ki
5.5±n/a nM
Citation
 Alafeefy, AMCarta, FCeruso, MAl-Tamimi, AMAl-Kahtani, AASupuran, CT Development of 3-(4-aminosulphonyl)-phenyl-2-mercapto-3H-quinazolin-4-ones as inhibitors of carbonic anhydrase isoforms involved in tumorigenesis and glaucoma. Bioorg Med Chem 24:1402-7 (2016)  
Target
Name:
Carbonic anhydrase 12
Synonyms:
CA-XII CAH12_HUMAN Carbonic anhydrase Carbonic anhydrase XII Carbonic anhydrase XII (CAXII) | Tumor antigen HOM-RCC-3.1.3
Type:
Enzyme
Mol. Mass.:
39456.00
Organism:
Homo sapiens (Human)
Description:
Catalytic domain of human cloned isozyme was used in the assay
Residue:
354
  
Inhibitor
Name:
BDBM50147762
Synonyms:
CHEMBL3765033
Type:
Small organic molecule
Emp. Form.:
C14H10IN3O3S2
Mol. Mass.:
459.282
SMILES:
NS(=O)(=O)c1ccc(cc1)-n1c(S)nc2c(I)cccc2c1=O
: